{"text_format":"1","workbook":"xlsx","n_sheets":7,"sheets":["COTIZADOR","ADICIONALES_P","DEPENDIENTES","COTIZACION","COTIZACION.","TARIFAS","NIVEL_DE_PUESTO"],"not_rendered":{"charts":0,"images":11,"macros":1,"external_links":2,"defined_names":3,"comments":4,"pivot_tables":0},"unopened":[],"bounds":{"document_bytes":16777216,"sheet_cells":100000,"rows_first":2000,"rows_last":500,"rows_between":2000,"halvings":0,"cell_chars":16384,"cell_head_chars":4096},"cells_cut":0,"cells_raw":0,"read":"whole","date_system":"1900"}

{"sheet":"COTIZADOR","index":0,"n_rows":307,"n_cols":40,"rows_kept":307,"cut":false,"hidden":false,"merged":[[22,1,22,2],[24,1,24,2],[7,1,7,2],[11,1,11,2],[14,1,14,2],[19,1,19,2],[17,1,17,2]]}
[null,null,null,null,null,null,null,null,null,null,null,null,null,null,null,null,null,null,null,null,null,null,null,null,null,null,null,null,null,null,null,null,null,null,null,null,null,null,null,"SI"]
[null,null,null,null,null,null,null,null,null,null,null,null,null,null,null,null,null,null,null,"COBERTURA POTENCIADA",1,null,null,null,null,null,null,null,null,null,null,null,null,null,null,null,null,null,null,"NO"]
[null,null,null,null,null,null,null,null,null,null,null,null,null,null,null,null,null,null,null,"COBERTURA PARA ASCENDIENTES",2,null,null,null,"2024-01-01",{"$f":"+Y3+14","v":"2024-01-15"},1,null,null,"2024-01-01",20]
[null,null,null,null,null,null,null,null,null,null,null,null,null,null,null,null,null,null,null,null,null,null,null,null,{"$f":"+Z3+1","v":"2024-01-16"},{"$f":"+Y4+15","v":"2024-01-31"},{"$f":"+AA3+1","v":2},null,null,{"$f":"+AD3+1","v":"2024-01-02"},20]
[null,null,null,null,null,null,null,null,null,null,null,null,null,null,null,null,null,null,null,"H",null,null,null,null,{"$f":"+Z4+1","v":"2024-02-01"},{"$f":"+Y5+14","v":"2024-02-15"},{"$f":"+AA4+1","v":3},null,null,{"$f":"+AD4+1","v":"2024-01-03"},20]
[null,null,null,null,null,null,null,null,null,null,null,null,null,null,null,null,null,null,null,"M",null,null,null,null,"2024-02-16",{"$f":"+Y6+13","v":"2024-02-29"},4,null,null,"2024-01-04",20]
[null,null,null,null,null,null,null,null,null,null,null,null,null,null,null,null,null,null,null,null,null,null,null,null,"2024-03-01",{"$f":"+Y7+14","v":"2024-03-15"},5,null,null,"2024-01-05",20]
[null,"Tipo de Cotización",null,null,{"$f":"IFERROR(+VLOOKUP(D8,T2:U3,2,0),0)","v":0},null,null,null,null,null,null,null,null,null,null,null,null,null,null,0,null,null,null,null,"2024-03-16",{"$f":"+Y8+15","v":"2024-03-31"},6,null,null,"2024-01-06",20]
[null,null,null,null,null,null,null,null,null,null,null,null,null,null,null,null,null,null,null,1,null,null,null,null,"2024-04-01",{"$f":"+Y9+14","v":"2024-04-15"},7,null,null,"2024-01-07",20]
[null,null,null,null,"POR FAVOR INGRESE LOS SIGUIENTES DATOS DEL ASEGURADO TITULAR",null,null,null,null,null,null,null,null,null,null,null,null,null,null,2,null,null,null,null,"2024-04-16",{"$f":"+Y10+14","v":"2024-04-30"},8,null,null,"2024-01-08",20]
[null,null,null,null,null,null,null,null,null,null,null,null,null,null,null,null,null,null,null,3,null,null,null,null,"2024-05-01",{"$f":"+Y11+14","v":"2024-05-15"},9,null,null,"2024-01-09",20]
[null,"Puesto",null,null,{"$f":"+IFERROR(VLOOKUP(D12,NIVEL_DE_PUESTO!$B$3:$D$118,3,0),\"\")","v":""},"UMAM",null,null,null,null,null,null,null,null,null,null,null,null,null,4,null,null,null,null,"2024-05-16","2024-05-31",10,null,null,"2024-01-10",20]
[null,null,null,null,null,null,null,null,null,null,null,null,null,null,null,null,null,null,null,5,null,null,null,null,"2024-06-01",{"$f":"+Y13+14","v":"2024-06-15"},11,null,null,"2024-01-11",20]
[null,null,null,null,null,null,null,null,null,null,null,null,null,null,null,null,null,null,null,6,null,null,null,null,"2024-06-16",{"$f":"+Y14+14","v":"2024-06-30"},12,null,null,"2024-01-12",20]
[null,"Fecha de nacimiento",null,"1987-09-06",null,null,null,null,null,null,null,null,null,null,null,null,null,null,null,"2024-01-01",null,null,null,null,"2024-07-01",{"$f":"+Y15+14","v":"2024-07-15"},13,null,null,"2024-01-13",20]
[null,null,null,null,null,null,null,null,null,null,null,null,null,null,null,null,null,null,null,null,null,null,null,null,"2024-07-16","2024-07-31",14,null,null,"2024-01-14",20]
[null,null,null,null,null,null,null,null,null,null,null,null,null,null,null,null,null,null,null,null,null,null,null,null,"2024-08-01",{"$f":"+Y17+14","v":"2024-08-15"},15,null,null,"2024-01-15",20]
[null,"Edad",null,{"$f":"+IF(D15=\"\",\"\",ROUNDDOWN((TODAY()-D15)/365,0))","v":36},null,null,null,null,null,null,null,null,null,null,null,null,null,null,null,null,null,null,null,null,"2024-08-16","2024-08-31",16,null,null,"2024-01-16",19]
[null,null,null,null,null,null,null,null,null,null,null,null,null,null,null,null,null,null,null,null,null,null,null,null,"2024-09-01",{"$f":"+Y19+14","v":"2024-09-15"},17,null,null,"2024-01-17",19]
[null,"Sexo","M","H",null,null,null,null,null,null,null,null,null,null,null,null,null,null,null,null,null,null,null,null,"2024-09-16",{"$f":"+Y20+14","v":"2024-09-30"},18,null,null,"2024-01-18",19]
{"$rows_left_out":288}
{"sheet":"ADICIONALES_P","index":1,"n_rows":19,"n_cols":20,"rows_kept":19,"cut":false,"hidden":true,"merged":[[16,1,16,2],[9,1,9,2],[18,1,18,2]]}
[]
[null,null,null,null,null,null,null,null,null,null,null,null,null,null,null,null,null,null,null,"COBERTURA POTENCIADA"]
[null,null,null,null,null,null,null,null,null,null,null,null,null,null,null,null,null,null,null,"COBERTURA PARA ASCENDIENTES"]
[]
[null,null,null,null,null,null,null,null,null,null,null,null,null,null,null,null,null,null,null,"H"]
[null,null,null,null,null,null,null,null,null,null,null,null,null,null,null,null,null,null,null,"M"]
[]
[null,null,null,"CONYUGE\n\n(Menores de 85 años)"]
[]
[null,"¿Desea asegurarlo?"]
[]
[]
[]
[]
[null,null,null,"HIJOS\n\nNúmero de hijos a cotizar (menores de 25 años)"]
[]
[null,"¿Desea asegurarlos?"]
[]
[null,"Número de Hijos"]

{"sheet":"DEPENDIENTES","index":2,"n_rows":27,"n_cols":20,"rows_kept":27,"cut":false,"hidden":true,"merged":[[22,1,22,2],[24,1,24,2],[9,1,9,2],[13,1,13,2],[15,1,15,2]]}
[]
[null,null,null,null,null,null,null,null,null,null,null,null,null,null,null,null,null,null,null,"COBERTURA POTENCIADA"]
[null,null,null,null,null,null,null,null,null,null,null,null,null,null,null,null,null,null,null,"COBERTURA PARA ASCENDIENTES"]
[]
[null,null,null,null,null,null,null,null,null,null,null,null,null,null,null,null,null,null,null,"H"]
[null,null,null,null,null,null,null,null,null,null,null,null,null,null,null,null,null,null,null,"M"]
[]
[null,null,null,"ASCENDIENTES \n\nNúmero de Ascendientes a cotizar "]
[]
[null,"Número de Ascendientes"]
[]
[null,null,null,"ASCENDIENTE 1"]
[]
[null,"Fecha de nacimiento"]
[]
[null,"Edad",null,{"$f":"+IF(D14=\"\",\"\",ROUNDDOWN((TODAY()-D14)/365,0))","v":""}]
[]
[null,null,null,"H"]
[]
[]
{"$rows_left_out":8}
{"sheet":"COTIZACION","index":3,"n_rows":39,"n_cols":20,"rows_kept":39,"cut":false,"hidden":true,"merged":[[15,4,15,6],[14,4,14,6],[14,7,14,15],[7,3,7,16],[11,4,11,6],[11,7,11,15],[13,4,13,6],[13,7,13,15]]}
[null,null,null,null,null,null,null,null,null,null,null,null,{"$f":"+TODAY()","v":"2023-12-13"},{"$f":"+M1+15","v":"2023-12-28"}]
[null,null,null,null,null,null,null,null,null,null,null,null,null,null,null,null,null,null,null,"COBERTURA POTENCIADA"]
[null,null,null,null,null,null,null,null,null,null,null,null,null,null,null,null,null,null,null,"COBERTURA PARA ASCENDIENTES"]
[]
[null,null,null,null,null,null,null,null,null,null,null,null,null,null,null,null,null,null,null,"H"]
[null,null,null,null,null,null,null,null,null,null,null,null,null,null,null,null,null,null,null,"M"]
[]
[null,null,null,"COBERTURA POTENCIADA"]
[null,null,null,null,null,null,null,null,null,null,null,null,null,null,null,{"$f":"+\"CDMX a \"& TEXT(TODAY(),\"d/mmmm/aaaa\")","v":"CDMX a 13/diciembre/2023"}]
[]
[]
[null,null,null,null,"Fecha de cálculo",null,null,{"$f":"+TODAY()","v":"2023-12-13"}]
[]
[null,null,null,null,"Vigencia de la cotización ",null,null,{"$f":"+CONCATENATE(TEXT(TODAY(),\"d/mmmm/aaaa\"),\" al \",TEXT(TODAY()+15,\"d/mmmm/aaaa\"))","v":"13/diciembre/2023 al 28/diciembre/2023"}]
[null,null,null,null,"Vigencia de la póliza",null,null,{"$f":"+CONCATENATE(TEXT(COTIZADOR!D23,\"d/mmmm/aaaa\"),\" al \",TEXT(COTIZADOR!F23,\"d/mmmm/aaaa\"))","v":"0/enero/1900 al 31/diciembre/2024"}]
[null,null,null,null,"Dias de Vigentes",null,null,{"$f":"+COTIZADOR!D25","v":""}]
[]
[null,null,null,null,"ID TARIFA BASICA","ASEGURADO","SUMA ASEGURADA BÁSICA","PRIMA TOTAL ANUAL"]
[null,null,null,null,{"$f":"+CONCATENATE(COTIZADOR!D18,COTIZADOR!D20,COTIZADOR!E12)","v":"36H"},"TITULAR",{"$f":"+COTIZADOR!E12","v":""},{"$f":"+IFERROR(VLOOKUP(E19,TARIFAS!$A$3:$F$811,6,0),\"\")","v":""},null,null,"NÚMERO DE QUINCENAS:",{"$f":"+IFERROR(B39,\"\")","v":""}]
[]
{"$rows_left_out":20}
{"sheet":"COTIZACION.","index":4,"n_rows":37,"n_cols":20,"rows_kept":37,"cut":false,"hidden":true,"merged":[[22,5,22,6],[14,7,14,15],[15,4,15,6],[14,4,14,6],[7,3,7,16],[11,4,11,6],[11,7,11,15],[13,4,13,6],[13,7,13,15]]}
[null,null,null,null,null,null,null,null,null,null,null,null,{"$f":"+TODAY()","v":"2023-12-13"},{"$f":"+M1+15","v":"2023-12-28"}]
[null,null,null,null,null,null,null,null,null,null,null,null,null,null,null,null,null,null,null,"COBERTURA POTENCIADA"]
[null,null,null,null,null,null,null,null,null,null,null,null,null,null,null,null,null,null,null,"COBERTURA PARA ASCENDIENTES"]
[]
[null,null,null,null,null,null,null,null,null,null,null,null,null,null,null,null,null,null,null,"H"]
[null,null,null,null,null,null,null,null,null,null,null,null,null,null,null,null,null,null,null,"M"]
[]
[null,null,null,"COBERTURA PARA ASCENDENTES"]
[null,null,null,null,null,null,null,null,null,null,null,null,null,null,null,{"$f":"+\"CDMX a \"& TEXT(TODAY(),\"d/mmmm/aaaa\")","v":"CDMX a 13/diciembre/2023"}]
[]
[]
[null,null,null,null,"Fecha de cálculo",null,null,{"$f":"+TODAY()","v":"2023-12-13"}]
[]
[null,null,null,null,"Vigencia de la cotización ",null,null,{"$f":"+CONCATENATE(TEXT(TODAY(),\"d/mmmm/aaaa\"),\" al \",TEXT(TODAY()+15,\"d/mmmm/aaaa\"))","v":"13/diciembre/2023 al 28/diciembre/2023"}]
[null,null,null,null,"Vigencia de la póliza",null,null,{"$f":"+CONCATENATE(TEXT(COTIZADOR!D23,\"d/mmmm/aaaa\"),\" al \",TEXT(COTIZADOR!F23,\"d/mmmm/aaaa\"))","v":"0/enero/1900 al 31/diciembre/2024"}]
[null,null,null,null,"Dias de Vigentes",null,null,{"$f":"+COTIZADOR!D25","v":""}]
[]
[null,null,null,null,"ID TARIFA BASICA","ASEGURADO","SUMA ASEGURADA BÁSICA","PRIMA TOTAL POR EL PERIODO"]
[null,null,null,null,{"$f":"+CONCATENATE(COTIZADOR!D18,COTIZADOR!D20,COTIZADOR!E12)","v":"36H"},"TITULAR",{"$f":"+COTIZADOR!E12","v":""},{"$f":"+(VLOOKUP(E19,TARIFAS!$A$3:$F$811,6,0)*1.16)","v":{"$error":"#N/A"}}]
[null,null,null,null,{"$f":"++CONCATENATE(\"ASCENDIENTES\",DEPENDIENTES!$D$16,DEPENDIENTES!$D$18,$G$19)","v":"ASCENDIENTESH"},"PRIMA DE INCLUSIÓN DE ASCENDIENTE 1",{"$f":"IFERROR(COTIZADOR!E12,\"\")","v":""},{"$f":"IFERROR((IF(B29<=DEPENDIENTES!$D$10,(VLOOKUP($E$20,TARIFAS!$Z$3:$AE$411,6,0)/366)*H16,0)),0)","v":0}]
{"$rows_left_out":18}
{"sheet":"TARIFAS","index":5,"n_rows":811,"n_cols":49,"rows_kept":811,"cut":false,"hidden":true,"merged":[]}
["TARIFA BASICA",null,null,null,null,null,null,"TARIFA ","POTENCIACIÓN",null,null,null,null,null,null,null,null,null,null,null,null,null,null,null,null,"TARIFA",null,null,null,null,null,null,"TARIFA",2,{"$f":"+AH1+1","v":3},{"$f":"+AI1+1","v":4},5,6,7,8,9,10,11,12,13,14,15,16,17]
[null,"TITULARES CONYUGES E HIJOS",null,null,1,null,null,null,"POTEN",null,null,null,null,null,null,null,null,null,null,null,null,null,null,null,null,null,"ASCENDIENTES",null,null,null,null,null,null,"POT- ASCENDIENTES"]
["ID TARIFA BASICA","EDAD","SEXO","UMAM","TARIFA DIARIA","TARIFA ANUAL",null,"ID TARIFA POTENCIACION",94,111,148,185,222,259,295,333,444,592,740,850,1000,3000,5000,7000,null,"ID TARIFA ASCENDIENTES","EDAD","SEXO","UMAM","TARIFA DIARIA","TARIFA ANUAL",null,"ID TARIFA POT ASCEN.",7000,5000,3000,1000,850,740,592,444,333,295,259,222,185,148,111,94]
[{"$f":"+CONCATENATE($B4,$C4,$D4,)","v":"0H74"},0,"H",74,11.97,{"$f":"+E4*366","v":4381.0200000000004},null,{"$f":"+CONCATENATE($I$2,$B4,$C4,$D4,)","v":"POTEN0H74"},36.57,38.83,49.13,51.43,57.41,60.77,65.22,70.83,78.98,87.23,94.54,99.17,104.6,132.61000000000001,160.59,208.73,null,{"$f":"+CONCATENATE($AA$2,$AA4,$AB4,$AC4,)","v":"ASCENDIENTES35H74"},35,"H",74,281.08999999999997,{"$f":"+AD4*366","v":102878.93999999999},null,{"$f":"+CONCATENATE($AH$2,$AA4,$AB4,$AC4,)","v":"POT- ASCENDIENTES35H74"},900.82,692.96,572.24,451.45,427.92,407.96,376.21,340.98,305.36,281.31,262.16000000000003,247.72,222.01,212.11,167.45,159.44]
[{"$f":"+CONCATENATE($B5,$C5,$D5,)","v":"1H74"},1,"H",74,11.97,{"$f":"+E5*366","v":4381.0200000000004},null,{"$f":"+CONCATENATE($I$2,$B5,$C5,$D5,)","v":"POTEN1H74"},36.57,38.83,49.13,51.43,57.41,60.77,65.22,70.83,78.98,87.23,94.54,99.17,104.6,132.61000000000001,160.59,208.73,null,{"$f":"+CONCATENATE($AA$2,$AA5,$AB5,$AC5,)","v":"ASCENDIENTES36H74"},36,"H",74,281.08999999999997,{"$f":"+AD5*366","v":102878.93999999999},null,{"$f":"+CONCATENATE($AH$2,$AA5,$AB5,$AC5,)","v":"POT- ASCENDIENTES36H74"},900.82,692.96,572.24,451.45,427.92,407.96,376.21,340.98,305.36,281.31,262.16000000000003,247.72,222.01,212.11,167.45,159.44]
["2H74",2,"H",74,11.97,4381.0200000000004,null,"POTEN2H74",36.57,38.83,49.13,51.43,57.41,60.77,65.22,70.83,78.98,87.23,94.54,99.17,104.6,132.61000000000001,160.59,208.73,null,"ASCENDIENTES37H74",37,"H",74,281.08999999999997,102878.93999999999,null,"POT- ASCENDIENTES37H74",900.82,692.96,572.24,451.45,427.92,407.96,376.21,340.98,305.36,281.31,262.16000000000003,247.72,222.01,212.11,167.45,159.44]
["3H74",3,"H",74,11.97,4381.0200000000004,null,"POTEN3H74",36.57,38.83,49.13,51.43,57.41,60.77,65.22,70.83,78.98,87.23,94.54,99.17,104.6,132.61000000000001,160.59,208.73,null,"ASCENDIENTES38H74",38,"H",74,281.08999999999997,102878.93999999999,null,"POT- ASCENDIENTES38H74",900.82,692.96,572.24,451.45,427.92,407.96,376.21,340.98,305.36,281.31,262.16000000000003,247.72,222.01,212.11,167.45,159.44]
["4H74",4,"H",74,11.97,4381.0200000000004,null,"POTEN4H74",36.57,38.83,49.13,51.43,57.41,60.77,65.22,70.83,78.98,87.23,94.54,99.17,104.6,132.61000000000001,160.59,208.73,null,"ASCENDIENTES39H74",39,"H",74,281.08999999999997,102878.93999999999,null,"POT- ASCENDIENTES39H74",900.82,692.96,572.24,451.45,427.92,407.96,376.21,340.98,305.36,281.31,262.16000000000003,247.72,222.01,212.11,167.45,159.44]
["5H74",5,"H",74,11.97,4381.0200000000004,null,"POTEN5H74",36.57,38.83,49.13,51.43,57.41,60.77,65.22,70.83,78.98,87.23,94.54,99.17,104.6,132.61000000000001,160.59,208.73,null,"ASCENDIENTES40H74",40,"H",74,281.08999999999997,102878.93999999999,null,"POT- ASCENDIENTES40H74",900.82,692.96,572.24,451.45,427.92,407.96,376.21,340.98,305.36,281.31,262.16000000000003,247.72,222.01,212.11,167.45,159.44]
["6H74",6,"H",74,11.97,4381.0200000000004,null,"POTEN6H74",36.57,38.83,49.13,51.43,57.41,60.77,65.22,70.83,78.98,87.23,94.54,99.17,104.6,132.61000000000001,160.59,208.73,null,"ASCENDIENTES41H74",41,"H",74,281.08999999999997,102878.93999999999,null,"POT- ASCENDIENTES41H74",900.82,692.96,572.24,451.45,427.92,407.96,376.21,340.98,305.36,281.31,262.16000000000003,247.72,222.01,212.11,167.45,159.44]
["7H74",7,"H",74,11.97,4381.0200000000004,null,"POTEN7H74",36.57,38.83,49.13,51.43,57.41,60.77,65.22,70.83,78.98,87.23,94.54,99.17,104.6,132.61000000000001,160.59,208.73,null,"ASCENDIENTES42H74",42,"H",74,281.08999999999997,102878.93999999999,null,"POT- ASCENDIENTES42H74",900.82,692.96,572.24,451.45,427.92,407.96,376.21,340.98,305.36,281.31,262.16000000000003,247.72,222.01,212.11,167.45,159.44]
["8H74",8,"H",74,11.97,4381.0200000000004,null,"POTEN8H74",36.57,38.83,49.13,51.43,57.41,60.77,65.22,70.83,78.98,87.23,94.54,99.17,104.6,132.61000000000001,160.59,208.73,null,"ASCENDIENTES43H74",43,"H",74,281.08999999999997,102878.93999999999,null,"POT- ASCENDIENTES43H74",900.82,692.96,572.24,451.45,427.92,407.96,376.21,340.98,305.36,281.31,262.16000000000003,247.72,222.01,212.11,167.45,159.44]
["9H74",9,"H",74,11.97,4381.0200000000004,null,"POTEN9H74",36.57,38.83,49.13,51.43,57.41,60.77,65.22,70.83,78.98,87.23,94.54,99.17,104.6,132.61000000000001,160.59,208.73,null,"ASCENDIENTES44H74",44,"H",74,281.08999999999997,102878.93999999999,null,"POT- ASCENDIENTES44H74",900.82,692.96,572.24,451.45,427.92,407.96,376.21,340.98,305.36,281.31,262.16000000000003,247.72,222.01,212.11,167.45,159.44]
["10H74",10,"H",74,11.97,4381.0200000000004,null,"POTEN10H74",36.57,38.83,49.13,51.43,57.41,60.77,65.22,70.83,78.98,87.23,94.54,99.17,104.6,132.61000000000001,160.59,208.73,null,"ASCENDIENTES45H74",45,"H",74,281.08999999999997,102878.93999999999,null,"POT- ASCENDIENTES45H74",900.82,692.96,572.24,451.45,427.92,407.96,376.21,340.98,305.36,281.31,262.16000000000003,247.72,222.01,212.11,167.45,159.44]
["11H74",11,"H",74,11.97,4381.0200000000004,null,"POTEN11H74",36.57,38.83,49.13,51.43,57.41,60.77,65.22,70.83,78.98,87.23,94.54,99.17,104.6,132.61000000000001,160.59,208.73,null,"ASCENDIENTES46H74",46,"H",74,281.08999999999997,102878.93999999999,null,"POT- ASCENDIENTES46H74",900.82,692.96,572.24,451.45,427.92,407.96,376.21,340.98,305.36,281.31,262.16000000000003,247.72,222.01,212.11,167.45,159.44]
["12H74",12,"H",74,11.97,4381.0200000000004,null,"POTEN12H74",36.57,38.83,49.13,51.43,57.41,60.77,65.22,70.83,78.98,87.23,94.54,99.17,104.6,132.61000000000001,160.59,208.73,null,"ASCENDIENTES47H74",47,"H",74,281.08999999999997,102878.93999999999,null,"POT- ASCENDIENTES47H74",900.82,692.96,572.24,451.45,427.92,407.96,376.21,340.98,305.36,281.31,262.16000000000003,247.72,222.01,212.11,167.45,159.44]
["13H74",13,"H",74,11.97,4381.0200000000004,null,"POTEN13H74",36.57,38.83,49.13,51.43,57.41,60.77,65.22,70.83,78.98,87.23,94.54,99.17,104.6,132.61000000000001,160.59,208.73,null,"ASCENDIENTES48H74",48,"H",74,281.08999999999997,102878.93999999999,null,"POT- ASCENDIENTES48H74",900.82,692.96,572.24,451.45,427.92,407.96,376.21,340.98,305.36,281.31,262.16000000000003,247.72,222.01,212.11,167.45,159.44]
["14H74",14,"H",74,11.97,4381.0200000000004,null,"POTEN14H74",36.57,38.83,49.13,51.43,57.41,60.77,65.22,70.83,78.98,87.23,94.54,99.17,104.6,132.61000000000001,160.59,208.73,null,"ASCENDIENTES49H74",49,"H",74,281.08999999999997,102878.93999999999,null,"POT- ASCENDIENTES49H74",900.82,692.96,572.24,451.45,427.92,407.96,376.21,340.98,305.36,281.31,262.16000000000003,247.72,222.01,212.11,167.45,159.44]
["15H74",15,"H",74,11.97,4381.0200000000004,null,"POTEN15H74",36.57,38.83,49.13,51.43,57.41,60.77,65.22,70.83,78.98,87.23,94.54,99.17,104.6,132.61000000000001,160.59,208.73,null,"ASCENDIENTES50H74",50,"H",74,281.08999999999997,102878.93999999999,null,"POT- ASCENDIENTES50H74",900.82,692.96,572.24,451.45,427.92,407.96,376.21,340.98,305.36,281.31,262.16000000000003,247.72,222.01,212.11,167.45,159.44]
["16H74",16,"H",74,11.97,4381.0200000000004,null,"POTEN16H74",36.57,38.83,49.13,51.43,57.41,60.77,65.22,70.83,78.98,87.23,94.54,99.17,104.6,132.61000000000001,160.59,208.73,null,"ASCENDIENTES51H74",51,"H",74,281.08999999999997,102878.93999999999,null,"POT- ASCENDIENTES51H74",900.82,692.96,572.24,451.45,427.92,407.96,376.21,340.98,305.36,281.31,262.16000000000003,247.72,222.01,212.11,167.45,159.44]
{"$rows_left_out":792}
{"sheet":"NIVEL_DE_PUESTO","index":6,"n_rows":118,"n_cols":14,"rows_kept":118,"cut":false,"hidden":true,"merged":[]}
["NIVEL DE PUESTO"]
["Código","PUESTO ","\nNIVEL","SEGURO DE GASTOS MÉDICOS\n MAYORES (SUMA ASEGURADA BÁSICA)",null,null,null,null,"PUESTO ",null,"SEGURO DE GASTOS MÉDICOS\n MAYORES (SUMA ASEGURADA BÁSICA)",null,"\nNIVEL","\nDENOMINACIÓN"]
["FG0A001","FG0A001-Fiscal General","AZ1",74,"UMAM",null,{"$f":"+CONCATENATE(A3,\"-\",B3)","v":"FG0A001-FG0A001-Fiscal General"},null,"Fiscal General",null,74,"UMA´s","AZ1","Fiscal General"]
["FG0A002","FG0A002-Fiscal Especializado","AY1",74,"UMAM",null,{"$f":"+CONCATENATE(A4,\"-\",B4)","v":"FG0A002-FG0A002-Fiscal Especializado"},null,"Fiscal Especializado",null,74,"UMA´s","AY1","Fiscal Especializado"]
["FG0A003","FG0A003-Fiscal Especial","AX1",74,"UMAM",null,"FG0A003-FG0A003-Fiscal Especial",null,"Fiscal Especial",null,74,"UMA´s","AX1","Fiscal Especial"]
["FG0A004","FG0A004-Fiscal Especial","AX2",74,"UMAM",null,"FG0A004-FG0A004-Fiscal Especial",null,"Fiscal Especial",null,74,"UMA´s","AX2","Fiscal Especial"]
["FG0A005","FG0A005-Fiscal Especial","AX3",74,"UMAM",null,"FG0A005-FG0A005-Fiscal Especial",null,"Fiscal Especial",null,74,"UMA´s","AX3","Fiscal Especial"]
["FG0A006","FG0A006-Fiscal Especial","AW1",74,"UMAM",null,"FG0A006-FG0A006-Fiscal Especial",null,"Fiscal Especial",null,74,"UMA´s","AW1","Fiscal Especial"]
["FG0A007","FG0A007-Fiscal Especial","AW2",74,"UMAM",null,"FG0A007-FG0A007-Fiscal Especial",null,"Fiscal Especial",null,74,"UMA´s","AW2","Fiscal Especial"]
["FG0A008","FG0A008-Fiscal Especial","AW3",74,"UMAM",null,"FG0A008-FG0A008-Fiscal Especial",null,"Fiscal Especial",null,74,"UMA´s","AW3","Fiscal Especial"]
["FG0A009","FG0A009-Fiscal Federal","AV1",74,"UMAM",null,"FG0A009-FG0A009-Fiscal Federal",null,"Fiscal Federal",null,74,"UMA´s","AV1","Fiscal Federal"]
["FG0A010","FG0A010-Fiscal Federal","AV2",74,"UMAM",null,"FG0A010-FG0A010-Fiscal Federal",null,"Fiscal Federal",null,74,"UMA´s","AV2","Fiscal Federal"]
["FG0A011","FG0A011-Fiscal Federal","AV3",74,"UMAM",null,"FG0A011-FG0A011-Fiscal Federal",null,"Fiscal Federal",null,74,"UMA´s","AV3","Fiscal Federal"]
["FG0A012","FG0A012-Fiscal Federal","AU1",74,"UMAM",null,"FG0A012-FG0A012-Fiscal Federal",null,"Fiscal Federal",null,74,"UMA´s","AU1","Fiscal Federal"]
["FG0A013","FG0A013-Fiscal Federal","AU2",74,"UMAM",null,"FG0A013-FG0A013-Fiscal Federal",null,"Fiscal Federal",null,74,"UMA´s","AU2","Fiscal Federal"]
["FG0A014","FG0A014-Fiscal Federal","AU3",74,"UMAM",null,"FG0A014-FG0A014-Fiscal Federal",null,"Fiscal Federal",null,74,"UMA´s","AU3","Fiscal Federal"]
["FG0A015","FG0A015-Fiscal","AT1",74,"UMAM",null,"FG0A015-FG0A015-Fiscal",null,"Fiscal",null,74,"UMA´s","AT1","Fiscal"]
["FG0A016","FG0A016-Fiscal","AT2",74,"UMAM",null,"FG0A016-FG0A016-Fiscal",null,"Fiscal",null,74,"UMA´s","AT2","Fiscal"]
["FG0A017","FG0A017-Fiscal","AT3",74,"UMAM",null,"FG0A017-FG0A017-Fiscal",null,"Fiscal",null,74,"UMA´s","AT3","Fiscal"]
["FG0A018","FG0A018-Fiscal","AS1",74,"UMAM",null,"FG0A018-FG0A018-Fiscal",null,"Fiscal",null,74,"UMA´s","AS1","Fiscal"]
{"$rows_left_out":98}